Target
Cannabinoid receptor 2
Ligand
BDBM300209
Substrate
Meas. Tech.
cAMP Assay
EC50
159±n/a nM
Citation
 Grether, UNettekoven, MRogers-Evans, MRoever, SSchmitt, SKimbara, A Triazolo[4,5-D]pyrimidine derivatives US Patent  US9593123 Publication Date 3/14/2017 
Target
Name:
Cannabinoid receptor 2
Synonyms:
CANNABINOID CB2 CB2 CB2B CNR2_HUMAN Cannabinoid CB2 receptor Cannabinoid receptor 2 (CB2R) | hCB2
Type:
G Protein-Coupled Receptor (GPCR)
Mol. Mass.:
39690.94
Organism:
Homo sapiens (Human)
Description:
P34972
Residue:
360
  
Inhibitor
Name:
BDBM300209
Synonyms:
N-[(3S)-1-[3-[(2-Chlorophenyl)methyl]-5-[(2S)-1,1,1-trifluoropropan-2-yl]oxytriazolo [4,5-d]pyrimidin-7-yl]pyrrolidin-3-yl]acetamide | US9593123, Example 80
Type:
Small organic molecule
Emp. Form.:
C20H21ClF3N7O2
Mol. Mass.:
483.875
SMILES:
C[C@H](Oc1nc(N2CC[C@@H](C2)NC(C)=O)c2nnn(Cc3ccccc3Cl)c2n1)C(F)(F)F
: