Target
Cannabinoid receptor 2
Ligand
BDBM300225
Substrate
Meas. Tech.
cAMP Assay
EC50
5.10±n/a nM
Citation
 Grether, UNettekoven, MRogers-Evans, MRoever, SSchmitt, SKimbara, A Triazolo[4,5-D]pyrimidine derivatives US Patent  US9593123 Publication Date 3/14/2017 
Target
Name:
Cannabinoid receptor 2
Synonyms:
CANNABINOID CB2 CB2 CB2B CNR2_HUMAN Cannabinoid CB2 receptor Cannabinoid receptor 2 (CB2R) | hCB2
Type:
G Protein-Coupled Receptor (GPCR)
Mol. Mass.:
39690.94
Organism:
Homo sapiens (Human)
Description:
P34972
Residue:
360
  
Inhibitor
Name:
BDBM300225
Synonyms:
3-[(2-Chlorophenyl)methyl]-7-(3,3-difluoropyrrolidin-1-yl)-5-(2-methoxyethylsulfonyl)triazolo[4,5-d]pyrimidine | US9593123, Example 96
Type:
Small organic molecule
Emp. Form.:
C18H19ClF2N6O3S
Mol. Mass.:
472.897
SMILES:
COCCS(=O)(=O)c1nc(N2CCC(F)(F)C2)c2nnn(Cc3ccccc3Cl)c2n1
: