Target
Metabotropic glutamate receptor 5
Ligand
BDBM300234
Substrate
Meas. Tech.
Radioligand Binding Assay
IC50
12.5±n/a nM
Citation
 Riva, CDe Toma, CAngelico, PPoggesi, EGraziani, D Heterocyclylalkyne derivatives and their use as modulators of mGluR5 receptors US Patent  US9593127 Publication Date 3/14/2017 
Target
Name:
Metabotropic glutamate receptor 5
Synonyms:
GPRC1E GRM5_HUMAN metabotropic glutamate 5 | metabotropic glutamate 5a
Type:
Enzyme
Mol. Mass.:
132484.72
Organism:
Homo sapiens (Human)
Description:
Residue:
1212
  
Inhibitor
Name:
BDBM300234
Synonyms:
US9593127, Example 8 | [3-[2-(3-chlorophenyl)ethynyl]- 3a,4,5,6a- tetrahydropyrrolo[3,2- d]isoxazol-6-yl]-(1- piperidyl)methanone
Type:
Small organic molecule
Emp. Form.:
C19H20ClN3O2
Mol. Mass.:
357.834
SMILES:
Clc1cccc(c1)C#CC1=NOC2C1CCN2C(=O)N1CCCCC1
: