Target
Cyclin homolog/dependent kinase 6
Ligand
BDBM7459
Substrate
Histone H1
Meas. Tech.
Kinase Inhibition Assay
pH
7±n/a
Temperature
303.15±n/a K
IC50
>300000±n/a nM
Citation
 Lu, HChang, DJBaratte, BMeijer, LSchulze-Gahmen, U Crystal structure of a human cyclin-dependent kinase 6 complex with a flavonol inhibitor, fisetin. J Med Chem 48:737-43 (2005)  
Target
Name:
Cyclin homolog/dependent kinase 6
Synonyms:
CDK6/Vcyclin | Cyclin-Dependent Kinase 6 (CDK6)
Type:
Protein Complex
Mol. Mass.:
Description:
Components:
This complex has 2 components.
Component 1
Name:
Cyclin-dependent kinase 6
Synonyms:
CDK6 CDKN6 Cyclin-dependent kinase 6 (CDK 6) | Serine/threonine-protein kinase PLSTIRE
Type:
Enzyme Subunit
Mol. Mass.:
36937.42
Organism:
Homo sapiens (Human)
Description:
Q00534
Residue:
326
  
Component 2
Name:
Cyclin homolog
Synonyms:
72 ECLF2 viral cyclin
Type:
Enzyme Subunit
Mol. Mass.:
28634.62
Organism:
Saimiriine herpesvirus 2
Description:
Sf9 insect cells were infected with recombinant baculovirus containing the His-tagged Vcyclin gene. The protein was purified over a Talon column (BD Biosciences Clontech, Palo Alto, CA) followed by a Source Q ion-exchange column (Amersham Bioscience, Piscataway, NJ). The N-terminal His tag was removed from Vcyclin using recombinant tobacco etch virus protease.
Residue:
254
  
Inhibitor
Name:
BDBM7459
Synonyms:
2-(3,4-dihydroxyphenyl)-5,7-dihydroxy-4H-chromen-4-one CHEMBL151 Luteolin (4) cid_5280445 med.21724, Compound 3
Type:
Small organic molecule
Emp. Form.:
C15H10O6
Mol. Mass.:
286.2363
SMILES:
Oc1cc(O)c2c(c1)oc(cc2=O)-c1ccc(O)c(O)c1
:
Substrate
Name:
Histone H1
Synonyms:
Type:
Other Protein Type
Mol. Mass.:
358.43
Organism:
Bos taurus (bovine)
Description:
Residue:
3
NA