Target
Indoleamine 2,3-dioxygenase 1
Ligand
BDBM168400
Substrate
Meas. Tech.
IDO Kynurenine Assay
Temperature
298.15±n/a K
EC50
262±n/a nM
Comments
extracted
Citation
 PubChem, PCBalog, JAHuang, AChen, BChen, LSeitz, SPHart, ACMarkwalder, JA Inhibitors of indoleamine 2,3-dioxygenase (IDO) US Patent  US9675571 Publication Date 6/13/2017 
Target
Name:
Indoleamine 2,3-dioxygenase 1
Synonyms:
I23O1_HUMAN IDO-1 INDO Indoleamine 2,3-dioxygenase | Indoleamine-pyrrole 2,3-dioxygenase
Type:
Enzyme
Mol. Mass.:
45330.80
Organism:
Homo sapiens (Human)
Description:
P14902
Residue:
403
  
Inhibitor
Name:
BDBM168400
Synonyms:
US9675571, 63
Type:
Small organic molecule
Emp. Form.:
C24H33N3O4
Mol. Mass.:
427.5365
SMILES:
CC(C)CN(CC(C)C)c1ccc(cc1NC(=O)Cc1cc(C)no1)[C@@H]1C[C@@H]1C(O)=O
: