Target
Cyclin-dependent kinase 1/G2/mitotic-specific cyclin-B
Ligand
BDBM7486
Substrate
Histone H1
Meas. Tech.
Kinase Inhibition Assay
Temperature
303.15±n/a K
IC50
>50000±n/a nM
Comments
extracted
Citation
 Brana, MFCacho, MGarcia, MLMayoral, EPLopez, Bde Pascual-Teresa, BRamos, AAcero, NLlinares, FMunoz-Mingarro, DLozach, OMeijer, L Pyrazolo[3,4-c]pyridazines as novel and selective inhibitors of cyclin-dependent kinases. J Med Chem 48:6843-54 (2005)  
Target
Name:
Cyclin-dependent kinase 1/G2/mitotic-specific cyclin-B
Synonyms:
CDK1/Cyclin B p34cdc2/Cyclin B
Type:
Protein Complex
Mol. Mass.:
Description:
p34cdc2/cyclin B was purified from M-phase starfish oocytes by affinity chromatography.
Components:
This complex has 2 components.
Component 1
Name:
Cyclin-dependent kinase 1
Synonyms:
CDK1_ORYLA P34 protein kinase cdk1
Type:
Enzyme Subunit
Mol. Mass.:
34693.35
Organism:
Marthasterias glacialis (starfish)
Description:
Q9DGD3 {empty hard to find)
Residue:
303
  
Component 2
Name:
G2/mitotic-specific cyclin-B
Synonyms:
CCNB_MARGL G2/mitotic-specific cyclin-B1
Type:
Enzyme Subunit
Mol. Mass.:
43790.28
Organism:
Marthasterias glacialis (starfish)
Description:
Residue:
388
  
Inhibitor
Name:
BDBM7486
Synonyms:
1-benzyl-4,5-diphenyl-1H-pyrazolo[3,4-c]pyridazin-3-amine Pyrazolopyridazine 2h
Type:
Small organic molecule
Emp. Form.:
C24H19N5
Mol. Mass.:
377.4412
SMILES:
Nc1nn(Cc2ccccc2)c2nnc(-c3ccccc3)c(-c3ccccc3)c12
:
Substrate
Name:
Histone H1
Synonyms:
Type:
Other Protein Type
Mol. Mass.:
358.43
Organism:
Bos taurus (bovine)
Description:
Residue:
3
NA