Target
Cystic fibrosis transmembrane conductance regulator [G550E]
Ligand
BDBM300426
Substrate
Meas. Tech.
YFP-Halide Influx Assay
IC50
102±n/a nM
Target
Name:
Cystic fibrosis transmembrane conductance regulator [G550E]
Synonyms:
ABCC7 CFTR_HUMAN | Cystic fibrosis transmembrane conductance regulator mutant G550E
Type:
Enzyme Catalytic Domain
Mol. Mass.:
168242.36
Organism:
Homo sapiens (Human)
Description:
P13569[G550E]
Residue:
1480
  
Inhibitor
Name:
BDBM300426
Synonyms:
US10130622, Example 00005
Type:
Small organic molecule
Emp. Form.:
C26H34FN5O5S
Mol. Mass.:
547.642
SMILES:
COCCS(=O)(=O)NC(=O)c1cc(N2CCC(COC)CC2)c2c(nn(-c3ccc(F)cc3)c2n1)C(C)C
: