Target
Cyclin-dependent kinase 5 activator 1 [99-307]
Ligand
BDBM7491
Substrate
Histone H1
Meas. Tech.
Kinase Inhibition Assay
pH
7.2±n/a
Temperature
303.15±n/a K
IC50
28±n/a nM
Citation
 Kunick, CLauenroth, KLeost, MMeijer, LLemcke, T 1-Azakenpaullone is a selective inhibitor of glycogen synthase kinase-3 beta. Bioorg Med Chem Lett 14:413-6 (2004)  
Target
Name:
Cyclin-dependent kinase 5 activator 1 [99-307]
Synonyms:
CDK5/p25 | Cyclin-Dependent Kinase 5 (CDK5)
Type:
Protein Complex
Mol. Mass.:
Description:
Components:
This complex has 2 components.
Component 1
Name:
Cyclin-dependent kinase 5
Synonyms:
CDK5 CDKN5 Cyclin-dependent kinase 5 (CDK5/ p25) Cyclin-dependent-like kinase 5 PSSALRE Tau protein kinase II catalytic subunit
Type:
Enzyme Subunit
Mol. Mass.:
33308.61
Organism:
Homo sapiens (Human)
Description:
Residue:
292
  
Component 2
Name:
Cyclin-dependent kinase 5 activator 1 [99-307]
Synonyms:
CD5R1_HUMAN CDK5R1 Cyclin-dependent kinase 5 activator 1, p25 TPKII regulatory subunit | p25
Type:
Enzyme Subunit
Mol. Mass.:
23250.56
Organism:
Homo sapiens (Human)
Description:
Q15078 aa 99-307
Residue:
209
  
Inhibitor
Name:
BDBM7491
Synonyms:
(4Z)-4-(2-amino-5-oxo-3,5-dihydro-4H-imidazol-4-ylidene)-2-bromo-4,5,6,7-tetrahydropyrrolo[2,3-c]azepin-8(1H)-one (Z)-hymenialdisine 4-(2-Amino-4-oxo-2-imidazolidin-5-ylidene)-2-bromo-4,5,6,7-tetrahydropyrrolo[2,3-c]azepin-8-one 4-(2-amino-4-oxo-1H-imidazol-5(4H)-ylidene)-2-bromo-4,5,6,7-tetrahydropyrrolo[2,3-c]azepin-8(1H)-one 4-[2-Amino-5-oxo-3,5-dihydro-imidazol-(4Z)-ylidene]-2-bromo-4,5,6,7-tetrahydro-1H-pyrrolo[2,3-c]azepin-8-one Hymenialdisine | Hymenialdisine, 1
Type:
Small organic molecule
Emp. Form.:
C11H10BrN5O2
Mol. Mass.:
324.133
SMILES:
NC1=NC(=O)C(N1)=C1CCNC(=O)c2[nH]c(Br)cc12
:
Substrate
Name:
Histone H1
Synonyms:
Type:
Other Protein Type
Mol. Mass.:
358.43
Organism:
Bos taurus (bovine)
Description:
Residue:
3
NA