Target
Cyclin-dependent kinase 5 activator 1 [99-307]
Ligand
BDBM7497
Substrate
Histone H1
Meas. Tech.
Kinase Inhibition Assay
pH
7.2±n/a
Temperature
303.15±n/a K
IC50
4200±n/a nM
Citation
 Kunick, CLauenroth, KLeost, MMeijer, LLemcke, T 1-Azakenpaullone is a selective inhibitor of glycogen synthase kinase-3 beta. Bioorg Med Chem Lett 14:413-6 (2004)  
Target
Name:
Cyclin-dependent kinase 5 activator 1 [99-307]
Synonyms:
CDK5/p25 | Cyclin-Dependent Kinase 5 (CDK5)
Type:
Protein Complex
Mol. Mass.:
Description:
Components:
This complex has 2 components.
Component 1
Name:
Cyclin-dependent kinase 5
Synonyms:
CDK5 CDKN5 Cyclin-dependent kinase 5 (CDK5/ p25) Cyclin-dependent-like kinase 5 PSSALRE Tau protein kinase II catalytic subunit
Type:
Enzyme Subunit
Mol. Mass.:
33308.61
Organism:
Homo sapiens (Human)
Description:
Residue:
292
  
Component 2
Name:
Cyclin-dependent kinase 5 activator 1 [99-307]
Synonyms:
CD5R1_HUMAN CDK5R1 Cyclin-dependent kinase 5 activator 1, p25 TPKII regulatory subunit | p25
Type:
Enzyme Subunit
Mol. Mass.:
23250.56
Organism:
Homo sapiens (Human)
Description:
Q15078 aa 99-307
Residue:
209
  
Inhibitor
Name:
BDBM7497
Synonyms:
1-Azakenpaullone US11759530, Compound Table1.11
Type:
Small organic molecule
Emp. Form.:
C15H10BrN3O
Mol. Mass.:
328.163
SMILES:
Brc1ccc2[nH]c-3c(CC(=O)Nc4cccnc-34)c2c1
:
Substrate
Name:
Histone H1
Synonyms:
Type:
Other Protein Type
Mol. Mass.:
358.43
Organism:
Bos taurus (bovine)
Description:
Residue:
3
NA