Target
Cyclin-A2/Cyclin-dependent kinase 2
Ligand
BDBM7502
Substrate
GST-Rb fusion protein
Meas. Tech.
CDK Kinase Inhibition Assay
pH
7.2±n/a
Temperature
310.15±n/a K
IC50
2980±n/a nM
Citation
 Schoepfer, JFretz, HChaudhuri, BMuller, LSeeber, EMeijer, LLozach, OVangrevelinghe, EFuret, P Structure-based design and synthesis of 2-benzylidene-benzofuran-3-ones as flavopiridol mimics. J Med Chem 45:1741-7 (2002)  
Target
Name:
Cyclin-A2/Cyclin-dependent kinase 2
Synonyms:
CDK2-CyclinA CDK2/Cyclin A Cyclin A2/dependent kinase 2 Cyclin-Dependent Kinase 2 (CDK2A)
Type:
Protein Complex
Mol. Mass.:
Description:
Cdk2/Cyclin A kinase was purified from insect cells coinfected with Cyclin A/Cdk2 baculovirus.
Components:
This complex has 2 components.
Component 1
Name:
Cyclin-dependent kinase 2
Synonyms:
CDK2 CDK2_HUMAN Cell division protein kinase 2 Protein cereblon/Cyclin-dependent kinase 2 | p33 protein kinase
Type:
Enzyme Subunit
Mol. Mass.:
33938.17
Organism:
Homo sapiens (Human)
Description:
P24941
Residue:
298
  
Component 2
Name:
Cyclin-A2
Synonyms:
CCN1 CCNA1 CCNA2_HUMAN Cyclin-A
Type:
Enzyme Subunit
Mol. Mass.:
48550.19
Organism:
Homo sapiens (Human)
Description:
P20248
Residue:
432
  
Inhibitor
Name:
BDBM7502
Synonyms:
(2Z)-4,6-dihydroxy-2-[4-(4-methylpiperazin-1-yl)benzylidene]-7-(1-methylpiperidin-4-yl)-1-benzofuran-3(2H)-one Benzofuranone deriv. 8
Type:
Small organic molecule
Emp. Form.:
C26H31N3O4
Mol. Mass.:
449.542
SMILES:
CN1CCC(CC1)c1c2O\C(=C/c3ccc(cc3)N3CCN(C)CC3)C(=O)c2c(O)cc1O
:
Substrate
Name:
GST-Rb fusion protein
Synonyms:
Glutathione S-transferase (GST)-retinoblastoma (Rb) fusion RB1 Rb | retinoblastoma
Type:
Other Protein Type
Mol. Mass.:
106410.17
Organism:
Homo sapiens (Human)
Description:
GST-60 kDa Rb fusion protein (comprising amino acids 378 to 928 of retinoblastoma)
Residue:
928