Target
Protein Wnt-3a
Ligand
BDBM300509
Substrate
Meas. Tech.
HCT116 FOPFlash
IC50
>50000±n/a nM
Comments
0.000 12/22/2021
Citation
 Thede, KScott, WBender, EGolz, SHägebarth, ALienau, PPuehler, FBasting, DSchneider, DMöwes, MRichter, AZorn, LLiu, NMönning, USiegel, F Compounds US Patent  US10130633 Publication Date 11/20/2018 
Target
Name:
Protein Wnt-3a
Synonyms:
WNT3A | WNT3A_HUMAN
Type:
PROTEIN
Mol. Mass.:
39379.02
Organism:
Homo sapiens (Human)
Description:
ChEMBL_1469237
Residue:
352
  
Inhibitor
Name:
BDBM300509
Synonyms:
4-chloro-N-[6-(2-fluorophenyl)pyridin-3-yl]-3-({[1-(morpholin-4-yl)cyclopropyl]carbonyl}amino)benzamide | US10130633, Example 79
Type:
Small organic molecule
Emp. Form.:
C26H24ClFN4O3
Mol. Mass.:
494.945
SMILES:
Fc1ccccc1-c1ccc(NC(=O)c2ccc(Cl)c(NC(=O)C3(CC3)N3CCOCC3)c2)cn1
: