Target
Protein Wnt-3a
Ligand
BDBM300643
Substrate
Meas. Tech.
HCT116 FOPFlash
IC50
>50000±n/a nM
Comments
0.000 12/22/2021
Citation
 Thede, KScott, WBender, EGolz, SHägebarth, ALienau, PPuehler, FBasting, DSchneider, DMöwes, MRichter, AZorn, LLiu, NMönning, USiegel, F Compounds US Patent  US10130633 Publication Date 11/20/2018 
Target
Name:
Protein Wnt-3a
Synonyms:
WNT3A | WNT3A_HUMAN
Type:
PROTEIN
Mol. Mass.:
39379.02
Organism:
Homo sapiens (Human)
Description:
ChEMBL_1469237
Residue:
352
  
Inhibitor
Name:
BDBM300643
Synonyms:
6-(2-fluorophenyl)-N-[3-{[2- (morpholin-4- yl)propanoyl]amino}-4- (trifluoromethoxy)phenyl] nicotinamide | US10130633, Example 213
Type:
Small organic molecule
Emp. Form.:
C26H24F4N4O4
Mol. Mass.:
532.4868
SMILES:
CC(N1CCOCC1)C(=O)Nc1cc(NC(=O)c2ccc(nc2)-c2ccccc2F)ccc1OC(F)(F)F
: