Target
Protein Wnt-3a
Ligand
BDBM300581
Substrate
Meas. Tech.
HEK FOP Assay
IC50
>50000±n/a nM
Comments
0.000 12/22/2021
Citation
 Thede, KScott, WBender, EGolz, SHägebarth, ALienau, PPuehler, FBasting, DSchneider, DMöwes, MRichter, AZorn, LLiu, NMönning, USiegel, F Compounds US Patent  US10130633 Publication Date 11/20/2018 
Target
Name:
Protein Wnt-3a
Synonyms:
WNT3A | WNT3A_HUMAN
Type:
PROTEIN
Mol. Mass.:
39379.02
Organism:
Homo sapiens (Human)
Description:
ChEMBL_1469237
Residue:
352
  
Inhibitor
Name:
BDBM300581
Synonyms:
N-[5-(3-chlorophenyl)-1,3,4-thiadiazol-2-yl]-3-{[(4-methylpiperazin-1-yl)acetyl]amino}-4-(trifluoromethoxy)benzamide | US10130633, Example 151
Type:
Small organic molecule
Emp. Form.:
C23H22ClF3N6O3S
Mol. Mass.:
554.972
SMILES:
CN1CCN(CC(=O)Nc2cc(ccc2OC(F)(F)F)C(=O)Nc2nnc(s2)-c2cccc(Cl)c2)CC1
: