Target
Neuraminidase
Ligand
BDBM474370
Substrate
EC50
1800±n/a nM
Citation
 Jain, RKoester, DCManning, JRSutton, JCTaft, BRWan, LZhao, Q Tricyclic compounds useful to treat orthomyxovirus infections US Patent  US10858366 Publication Date 12/8/2020 
Target
Name:
Neuraminidase
Synonyms:
NA | NRAM_I71A1
Type:
PROTEIN
Mol. Mass.:
52105.18
Organism:
Influenza A virus (strain A/Memphis/1/1971 H3N2)
Description:
ChEMBL_578382
Residue:
469
  
Inhibitor
Name:
BDBM474370
Synonyms:
(S)-6-benzhydryl-11-hydroxy-3- (trifluoromethyl)-5,6-dihydro-10H- imidazo[1,2-a]pyrido[2,1-c]pyrazin-10-one | US10858366, Example 58
Type:
Small organic molecule
Emp. Form.:
C24H18F3N3O2
Mol. Mass.:
437.4138
SMILES:
Oc1c2-c3ncc(n3C[C@H](C(c3ccccc3)c3ccccc3)n2ccc1=O)C(F)(F)F
: