Target
Neuraminidase
Ligand
BDBM474375
Substrate
Meas. Tech.
Influenza Virus Neuraminidase Assay (NA Assay)
EC50
4100±n/a nM
Citation
 Jain, RKoester, DCManning, JRSutton, JCTaft, BRWan, LZhao, Q Tricyclic compounds useful to treat orthomyxovirus infections US Patent  US10858366 Publication Date 12/8/2020 
Target
Name:
Neuraminidase
Synonyms:
NA | NRAM_I33A0
Type:
PROTEIN
Mol. Mass.:
49687.56
Organism:
Influenza A virus (strain A/Wilson-Smith/1933 H1N1) (Influenza A virus(strain A/WS/1933 H1N1))
Description:
ChEMBL_881601
Residue:
453
  
Inhibitor
Name:
BDBM474375
Synonyms:
(S)-6-benzhydryl-11-hydroxy-3- (morpholinomethyl)-5,6-dihydro-10H- imidazo[1,2-a]pyrido[2,1-c]pyrazin-10-one | US10858366, Example 67
Type:
Small organic molecule
Emp. Form.:
C28H28N4O3
Mol. Mass.:
468.5469
SMILES:
Oc1c2-c3ncc(CN4CCOCC4)n3C[C@H](C(c3ccccc3)c3ccccc3)n2ccc1=O
: