Target
Neprilysin
Ligand
BDBM300719
Substrate
Meas. Tech.
Enzyme Inhibition Assays
Ki
1000000000±n/a nM
Citation
 Fleury, MGendron, RHughes, AD Neprilysin inhibitors US Patent  US10130642 Publication Date 11/20/2018 
Target
Name:
Neprilysin
Synonyms:
Atriopeptidase CD_antigen=CD10 EPN MME NEP_HUMAN Neutral endopeptidase | Neutral endopeptidase 24.11
Type:
Enzyme
Mol. Mass.:
85505.38
Organism:
Homo sapiens (Human)
Description:
P08473
Residue:
750
  
Inhibitor
Name:
BDBM300719
Synonyms:
US10130642, Example 4-15
Type:
Small organic molecule
Emp. Form.:
C17H22N4O5
Mol. Mass.:
362.3804
SMILES:
CCOC(=O)C(CO)CC(Cc1ccccc1)NC(=O)c1nc(O)n[nH]1
: