Target
Neprilysin
Ligand
BDBM300760
Substrate
Meas. Tech.
Enzyme Inhibition Assays
Ki
<1.000±n/a nM
Citation
 Fleury, MGendron, RHughes, AD Neprilysin inhibitors US Patent  US10130642 Publication Date 11/20/2018 
Target
Name:
Neprilysin
Synonyms:
Atriopeptidase CD_antigen=CD10 EPN MME NEP_HUMAN Neutral endopeptidase | Neutral endopeptidase 24.11
Type:
Enzyme
Mol. Mass.:
85505.38
Organism:
Homo sapiens (Human)
Description:
P08473
Residue:
750
  
Inhibitor
Name:
BDBM300760
Synonyms:
5-[(1R,3S)-3-Carboxy-1-(3′-fluorobiphenyl-4-ylmethyl)-4-hydroxy-3-methyl-butylcarbamoyl]-1H-pyrazole-3-carboxylic Acid | US10130642, Example 7
Type:
Small organic molecule
Emp. Form.:
C24H24FN3O6
Mol. Mass.:
469.4623
SMILES:
C[C@@](CO)(C[C@@H](Cc1ccc(cc1)-c1cccc(F)c1)NC(=O)c1cc(n[nH]1)C(O)=O)C(O)=O
: