Target
Neprilysin
Ligand
BDBM300769
Substrate
Meas. Tech.
Enzyme Inhibition Assays
Ki
<1.000±n/a nM
Citation
 Fleury, MGendron, RHughes, AD Neprilysin inhibitors US Patent  US10130642 Publication Date 11/20/2018 
Target
Name:
Neprilysin
Synonyms:
Atriopeptidase CD_antigen=CD10 EPN MME NEP_HUMAN Neutral endopeptidase | Neutral endopeptidase 24.11
Type:
Enzyme
Mol. Mass.:
85505.38
Organism:
Homo sapiens (Human)
Description:
P08473
Residue:
750
  
Inhibitor
Name:
BDBM300769
Synonyms:
US10130642, Example 10-2
Type:
Small organic molecule
Emp. Form.:
C24H27N3O4
Mol. Mass.:
421.4889
SMILES:
CC(C)(C(CC(CO)C(O)=O)Cc1ccc(cc1)-c1ccccc1)C(=O)c1cnn[nH]1
: