Target
Genome polyprotein
Ligand
BDBM300796
Substrate
Meas. Tech.
HCV Replicon Luciferase Assay
EC50
<100±n/a nM
Citation
 Wang, TYin, ZKadow, JF Benzofurans substituted with primary benzamide as HCV inhibitors US Patent  US10131645 Publication Date 11/20/2018 
Target
Name:
Genome polyprotein
Synonyms:
Genome polyprotein RNA polymerase (NS5B)
Type:
Enzyme
Mol. Mass.:
326966.11
Organism:
Hepatitis C virus (HCV)
Description:
Q9WMX2
Residue:
3010
  
Inhibitor
Name:
BDBM300796
Synonyms:
US10131645, Compound 5002
Type:
Small organic molecule
Emp. Form.:
C34H29F5N4O5S
Mol. Mass.:
700.675
SMILES:
CNC(=O)c1c(oc2cc(N(CCCF)S(C)(=O)=O)c(cc12)-c1cccc(c1)C(=O)NC(c1ccccn1)C(F)(F)F)-c1ccc(F)cc1
: