Target
Free fatty acid receptor 1
Ligand
BDBM300811
Substrate
Meas. Tech.
GPR40 Calcium Flux Assay
EC50
17.0±n/a nM
Citation
 Huang, HKuo, GPlayer, MRYang, SZhang, Y Substituted benzothiophenyl derivatives as GPR40 agonists for the treatment of type II diabetes US Patent  US10131648 Publication Date 11/20/2018 
Target
Name:
Free fatty acid receptor 1
Synonyms:
FFAR1 G-protein Coupled Receptor 40 | GPR40
Type:
G Protein-Coupled Receptor (GPCR)
Mol. Mass.:
31473.32
Organism:
Homo sapiens (Human)
Description:
O14842
Residue:
300
  
Inhibitor
Name:
BDBM300811
Synonyms:
(3S)-3-[4-[[3-[4-(1,1- Dioxothian-4-yl)oxy-2-methyl- phenyl]-2-methyl- benzo[b]thiophen-5- yl]methoxy]phenyl] hex-4-ynoic acid US10195178, Compound 9 | US9790198, Compound 9
Type:
Small organic molecule
Emp. Form.:
C34H34O6S2
Mol. Mass.:
602.76
SMILES:
CC#C[C@@H](CC(O)=O)c1ccc(OCc2ccc3sc(C)c(-c4ccc(OC5CCS(=O)(=O)CC5)cc4C)c3c2)cc1
: