Target
Free fatty acid receptor 1
Ligand
BDBM300851
Substrate
Meas. Tech.
GPR40 Calcium Flux Assay
EC50
9.00±n/a nM
Citation
 Huang, HKuo, GPlayer, MRYang, SZhang, Y Substituted benzothiophenyl derivatives as GPR40 agonists for the treatment of type II diabetes US Patent  US10131648 Publication Date 11/20/2018 
Target
Name:
Free fatty acid receptor 1
Synonyms:
FFAR1 G-protein Coupled Receptor 40 | GPR40
Type:
G Protein-Coupled Receptor (GPCR)
Mol. Mass.:
31473.32
Organism:
Homo sapiens (Human)
Description:
O14842
Residue:
300
  
Inhibitor
Name:
BDBM300851
Synonyms:
(3S)-3-(4-((3-(5-(2- Methoxyethoxy)-2- methylpyridin-3- yl)benzo[b]thiophen-5- yl)methoxy)phenyl) hex-4-ynoic acid US10195178, Compound 49 | US9790198, Compound 49
Type:
Small organic molecule
Emp. Form.:
C30H29NO5S
Mol. Mass.:
515.62
SMILES:
COCCOc1cnc(C)c(c1)-c1csc2ccc(COc3ccc(cc3)[C@H](CC(O)=O)C#CC)cc12
: