Target
Integrin alpha-5/beta-1 [T112H]
Ligand
BDBM300923
Substrate
Meas. Tech.
Cell Adhesion Assay
IC50
505±n/a nM
Citation
 DeGrado, WFSheppard, DJo, HReed, NITang, Y Anti-alphavbeta1 integrin compounds and methods US Patent  US10131658 Publication Date 11/20/2018 
Target
Name:
Integrin alpha-5/beta-1 [T112H]
Synonyms:
Integrin alpha5beta1
Type:
Protein Complex
Mol. Mass.:
Description:
Transfected K562 cell.
Components:
This complex has 2 components.
Component 1
Name:
Integrin beta-1 [T112H]
Synonyms:
CD29 antigen Fibronectin receptor subunit beta ITGB1 Integrin beta1 MSK12
Type:
Membrane Protein
Mol. Mass.:
88450.95
Organism:
Homo sapiens (Human)
Description:
P05556[T112H]
Residue:
798
  
Component 2
Name:
Integrin alpha-5
Synonyms:
CD49 antigen-like family member E FNRA Fibronectin receptor subunit alpha ITGA5 Integrin alpha-F | VLA-5
Type:
Single-pass type I membrane protein
Mol. Mass.:
114523.00
Organism:
Homo sapiens (Human)
Description:
Residue:
1049
  
Inhibitor
Name:
BDBM300923
Synonyms:
US10131658, Compound 10
Type:
Small organic molecule
Emp. Form.:
C27H36N6O6S
Mol. Mass.:
572.676
SMILES:
NC(=N)NCCCCCC(=O)Nc1ccc(C[C@H](NC(=O)[C@@H]2CCCN2S(=O)(=O)c2ccccc2)C(O)=O)cc1
: