Target
Estrogen receptor
Ligand
BDBM300945
Substrate
Meas. Tech.
ERalpha Binding Assay
IC50
6.60±n/a nM
Citation
 Barlaam, BCO Donovan, DHHughes, SJMoss, TANissink, JWScott, JSYang, B Chemical compounds US Patent  US10131663 Publication Date 11/20/2018 
Target
Name:
Estrogen receptor
Synonyms:
ER ESR ESR1_HUMAN Estrogen receptor Estrogen receptor (ER-alpha) Estrogen receptor alpha (ER) Nuclear receptor subfamily 3 group A member 1
Type:
Protein
Mol. Mass.:
66230.44
Organism:
Homo sapiens (Human)
Description:
P03372
Residue:
595
  
Inhibitor
Name:
BDBM300945
Synonyms:
N-(4-((6S,8R)-7-(2-fluoro-3-methoxy-2-methylpropyl)-8-methyl-6,7,8,9-tetrahydro-3H-pyrazolo[4,3-f]isoquinolin-6-yl)-3-methoxyphenyl)-1-(3-fluoropropyl)azetidin-3-amine US10590130, Example 15 | US10961241, Example 15
Type:
Small organic molecule
Emp. Form.:
C29H39F2N5O2
Mol. Mass.:
527.6491
SMILES:
COC[C@](C)(F)CN1[C@H](C)Cc2c(ccc3[nH]ncc23)[C@H]1c1ccc(NC2CN(CCCF)C2)cc1OC
: