Target
Estrogen receptor
Ligand
BDBM300956
Substrate
Meas. Tech.
MCF-7 ER Down-Regulation Assay
IC50
0.062±n/a nM
Citation
 Barlaam, BCO Donovan, DHHughes, SJMoss, TANissink, JWScott, JSYang, B Chemical compounds US Patent  US10131663 Publication Date 11/20/2018 
Target
Name:
Estrogen receptor
Synonyms:
ER ESR ESR1_HUMAN Estrogen receptor Estrogen receptor (ER-alpha) Estrogen receptor alpha (ER) Nuclear receptor subfamily 3 group A member 1
Type:
Protein
Mol. Mass.:
66230.44
Organism:
Homo sapiens (Human)
Description:
P03372
Residue:
595
  
Inhibitor
Name:
BDBM300956
Synonyms:
(6S,8R)-7-(2,2-difluoroethyl)-6-(4-((1-(3-fluoropropyl)azetidin-3-yl)oxy)-2-methoxyphenyl)-8-methyl-6,7,8,9-tetrahydro-3H-pyrazolo[4,3-f]isoquinoline US10590130, Example 22 | US10961241, Example 22
Type:
Small organic molecule
Emp. Form.:
C26H31F3N4O2
Mol. Mass.:
488.5451
SMILES:
COc1cc(OC2CN(CCCF)C2)ccc1[C@H]1N(CC(F)F)[C@H](C)Cc2c1ccc1[nH]ncc21
: