Target
Estrogen receptor
Ligand
BDBM300967
Substrate
Meas. Tech.
MCF-7 ER Down-Regulation Assay
IC50
0.100±n/a nM
Citation
 Barlaam, BCO Donovan, DHHughes, SJMoss, TANissink, JWScott, JSYang, B Chemical compounds US Patent  US10131663 Publication Date 11/20/2018 
Target
Name:
Estrogen receptor
Synonyms:
ER ESR ESR1_HUMAN Estrogen receptor Estrogen receptor (ER-alpha) Estrogen receptor alpha (ER) Nuclear receptor subfamily 3 group A member 1
Type:
Protein
Mol. Mass.:
66230.44
Organism:
Homo sapiens (Human)
Description:
P03372
Residue:
595
  
Inhibitor
Name:
BDBM300967
Synonyms:
5-Fluoro-6-((6S,8R)-1-fluoro-8-methyl-7-(2,2,2-trifluoroethyl)-6,7,8,9-tetrahydro-3H-pyrazolo[4,3-f]isoquinolin-6-yl)-N-(1-(3-fluoropropyl)azetidin-3-yl)pyridin-3-amine US10590130, Example 33 | US10961241, Example 33
Type:
Small organic molecule
Emp. Form.:
C24H26F6N6
Mol. Mass.:
512.4939
SMILES:
C[C@@H]1Cc2c(ccc3[nH]nc(F)c23)[C@H](N1CC(F)(F)F)c1ncc(NC2CN(CCCF)C2)cc1F
: