Target
Estrogen receptor
Ligand
BDBM300976
Substrate
Meas. Tech.
ERalpha Binding Assay
IC50
3.80±n/a nM
Citation
 Barlaam, BCO Donovan, DHHughes, SJMoss, TANissink, JWScott, JSYang, B Chemical compounds US Patent  US10131663 Publication Date 11/20/2018 
Target
Name:
Estrogen receptor
Synonyms:
ER ESR ESR1_HUMAN Estrogen receptor Estrogen receptor (ER-alpha) Estrogen receptor alpha (ER) Nuclear receptor subfamily 3 group A member 1
Type:
Protein
Mol. Mass.:
66230.44
Organism:
Homo sapiens (Human)
Description:
P03372
Residue:
595
  
Inhibitor
Name:
BDBM300976
Synonyms:
N-(1-(3- fluoropropyl) azetidin-3-yl)-5- ((6S,8R)-8- methyl-7- (2,2,2- trifluoroethyl)- 6,7,8,9- tetrahydro-3H- pyrazolo[4,3- f]isoquinolin- 6-yl)pyrazin-2- amine US10590130, Example 42 | US10961241, Example 42
Type:
Small organic molecule
Emp. Form.:
C23H27F4N7
Mol. Mass.:
477.501
SMILES:
C[C@@H]1Cc2c(ccc3[nH]ncc23)[C@H](N1CC(F)(F)F)c1cnc(NC2CN(CCCF)C2)cn1
: