Target
Estrogen receptor
Ligand
BDBM301005
Substrate
Meas. Tech.
ERalpha Binding Assay
IC50
2.00±n/a nM
Citation
 Barlaam, BCO Donovan, DHHughes, SJMoss, TANissink, JWScott, JSYang, B Chemical compounds US Patent  US10131663 Publication Date 11/20/2018 
Target
Name:
Estrogen receptor
Synonyms:
ER ESR ESR1_HUMAN Estrogen receptor Estrogen receptor (ER-alpha) Estrogen receptor alpha (ER) Nuclear receptor subfamily 3 group A member 1
Type:
Protein
Mol. Mass.:
66230.44
Organism:
Homo sapiens (Human)
Description:
P03372
Residue:
595
  
Inhibitor
Name:
BDBM301005
Synonyms:
5-fluoro-N-(1- (3- fluoropropyl) azetidin-3-yl)-6- ((6S,8R)-8- methyl-7- (2,2,3- trifluoropropyl)- 6,7,8,9- tetrahydro-3H- pyrazolo[4,3- f]isoquinolin- 6-yl)pyridin-3- amine US10590130, Example 71 | US10961241, Example 71
Type:
Small organic molecule
Emp. Form.:
C25H29F5N6
Mol. Mass.:
508.53
SMILES:
C[C@@H]1Cc2c(ccc3[nH]ncc23)[C@H](N1CC(F)(F)CF)c1ncc(NC2CN(CCCF)C2)cc1F
: