Target
Estrogen receptor
Ligand
BDBM301006
Substrate
Meas. Tech.
MCF-7 ER Down-Regulation Assay
IC50
0.510±n/a nM
Citation
 Barlaam, BCO Donovan, DHHughes, SJMoss, TANissink, JWScott, JSYang, B Chemical compounds US Patent  US10131663 Publication Date 11/20/2018 
Target
Name:
Estrogen receptor
Synonyms:
ER ESR ESR1_HUMAN Estrogen receptor Estrogen receptor (ER-alpha) Estrogen receptor alpha (ER) Nuclear receptor subfamily 3 group A member 1
Type:
Protein
Mol. Mass.:
66230.44
Organism:
Homo sapiens (Human)
Description:
P03372
Residue:
595
  
Inhibitor
Name:
BDBM301006
Synonyms:
(S)-6-(8,8- dimethyl-7- (2,2,2- trifluoroethyl)- 6,7,8,9- tetrahydro-3H- pyrazolo[4,3- f]isoquinolin- 6-yl)-N-(1-(3- fluoropropyl) azetidin-3- yl)pyridin-3- amine US10590130, Example 72 | US10961241, Example 72
Type:
Small organic molecule
Emp. Form.:
C25H30F4N6
Mol. Mass.:
490.5395
SMILES:
CC1(C)Cc2c(ccc3[nH]ncc23)[C@H](N1CC(F)(F)F)c1ccc(NC2CN(CCCF)C2)cn1
: