Target
Potassium voltage-gated channel subfamily H member 2
Ligand
BDBM300967
Substrate
Meas. Tech.
hERG Binding Assay
IC50
14000±n/a nM
Citation
 Barlaam, BCO Donovan, DHHughes, SJMoss, TANissink, JWScott, JSYang, B Chemical compounds US Patent  US10131663 Publication Date 11/20/2018 
Target
Name:
Potassium voltage-gated channel subfamily H member 2
Synonyms:
1,3-beta-glucan synthase component GLS2 ERG Eag-related protein 1 Ether-a-go-go-related gene (HERG) Ether-a-go-go-related gene potassium channel 1 Ether-a-go-go-related gene potassium channel 1 (hERG1) Ether-a-go-go-related protein 1 H-ERG KCNH2 Potassium voltage-gated channel subfamily H member 2 (hERG) Voltage-gated potassium channel subunit Kv11.1 hERG Potassium Channel 1 | putative potassium channel subunit
Type:
Multi-pass membrane protein
Mol. Mass.:
126672.65
Organism:
Homo sapiens (Human)
Description:
Q12809
Residue:
1159
  
Inhibitor
Name:
BDBM300967
Synonyms:
5-Fluoro-6-((6S,8R)-1-fluoro-8-methyl-7-(2,2,2-trifluoroethyl)-6,7,8,9-tetrahydro-3H-pyrazolo[4,3-f]isoquinolin-6-yl)-N-(1-(3-fluoropropyl)azetidin-3-yl)pyridin-3-amine US10590130, Example 33 | US10961241, Example 33
Type:
Small organic molecule
Emp. Form.:
C24H26F6N6
Mol. Mass.:
512.4939
SMILES:
C[C@@H]1Cc2c(ccc3[nH]nc(F)c23)[C@H](N1CC(F)(F)F)c1ncc(NC2CN(CCCF)C2)cc1F
: