Target
Potassium voltage-gated channel subfamily H member 2
Ligand
BDBM300979
Substrate
Meas. Tech.
hERG Binding Assay
IC50
4200±n/a nM
Citation
 Barlaam, BCO Donovan, DHHughes, SJMoss, TANissink, JWScott, JSYang, B Chemical compounds US Patent  US10131663 Publication Date 11/20/2018 
Target
Name:
Potassium voltage-gated channel subfamily H member 2
Synonyms:
1,3-beta-glucan synthase component GLS2 ERG Eag-related protein 1 Ether-a-go-go-related gene (HERG) Ether-a-go-go-related gene potassium channel 1 Ether-a-go-go-related gene potassium channel 1 (hERG1) Ether-a-go-go-related protein 1 H-ERG KCNH2 Potassium voltage-gated channel subfamily H member 2 (hERG) Voltage-gated potassium channel subunit Kv11.1 hERG Potassium Channel 1 | putative potassium channel subunit
Type:
Multi-pass membrane protein
Mol. Mass.:
126672.65
Organism:
Homo sapiens (Human)
Description:
Q12809
Residue:
1159
  
Inhibitor
Name:
BDBM300979
Synonyms:
N-(4-((6S,8R)- 7-(2,2- difluoroethyl)- 6,8-dimethyl- 6,7,8,9- tetrahydro-3H- pyrazolo[4,3- f]isoquinolin- 6-yl)-3- methoxyphenyl)- 1-(3- fluoropropyl) azetidin-3- amine US10590130, Example 45 | US10961241, Example 45
Type:
Small organic molecule
Emp. Form.:
C27H34F3N5O
Mol. Mass.:
501.587
SMILES:
COc1cc(NC2CN(CCCF)C2)ccc1[C@@]1(C)N(CC(F)F)[C@H](C)Cc2c1ccc1[nH]ncc21
: