Target
Potassium voltage-gated channel subfamily H member 2
Ligand
BDBM300995
Substrate
Meas. Tech.
hERG Binding Assay
IC50
>40000±n/a nM
Citation
 Barlaam, BCO Donovan, DHHughes, SJMoss, TANissink, JWScott, JSYang, B Chemical compounds US Patent  US10131663 Publication Date 11/20/2018 
Target
Name:
Potassium voltage-gated channel subfamily H member 2
Synonyms:
1,3-beta-glucan synthase component GLS2 ERG Eag-related protein 1 Ether-a-go-go-related gene (HERG) Ether-a-go-go-related gene potassium channel 1 Ether-a-go-go-related gene potassium channel 1 (hERG1) Ether-a-go-go-related protein 1 H-ERG KCNH2 Potassium voltage-gated channel subfamily H member 2 (hERG) Voltage-gated potassium channel subunit Kv11.1 hERG Potassium Channel 1 | putative potassium channel subunit
Type:
Multi-pass membrane protein
Mol. Mass.:
126672.65
Organism:
Homo sapiens (Human)
Description:
Q12809
Residue:
1159
  
Inhibitor
Name:
BDBM300995
Synonyms:
2,2-difluoro-3- ((6S,8R)-1- fluoro-6-(5- ((1-(3- fluoropropyl) azetidin-3- yl)amino)pyridin- 2-yl)-8- methyl- 3,6,8,9- tetrahydro-7H- pyrazolo[4,3- f]isoquinolin- 7-yl)propan-1- ol US10961241, Example 61
Type:
Small organic molecule
Emp. Form.:
C25H30F4N6O
Mol. Mass.:
506.5389
SMILES:
C[C@@H]1Cc2c(ccc3[nH]nc(F)c23)[C@H](N1CC(F)(F)CO)c1ccc(NC2CN(CCCF)C2)cn1
: