Target
Lysine-specific histone demethylase 1A
Ligand
BDBM301035
Substrate
Meas. Tech.
In Vitro Enzyme Inhibition Assay - LSD-1
IC50
<10±n/a nM
Citation
 Chen, YKKanouni, TKaldor, SWStafford, JAVeal, JM Inhibitors of lysine specific demethylase-1 US Patent  US10131664 Publication Date 11/20/2018 
Target
Name:
Lysine-specific histone demethylase 1A
Synonyms:
AOF2 Flavin-containing amine oxidase domain-containing protein 2 KDM1A KIAA0601 Lysine-specific demethylase 1 (LSD1) Lysine-specific histone demethylase 1 (LSD1)
Type:
Enzyme
Mol. Mass.:
92901.01
Organism:
Homo sapiens (Human)
Description:
O60341
Residue:
852
  
Inhibitor
Name:
BDBM301035
Synonyms:
(+-)-4-(2-{[(3-fluoropyrrolidin-3- yl)methyl]amino}-5-(4- methylphenyl)pyrimidin-4- yl)benzonitrile US10543198, Example 28 | US10864202, Example 28
Type:
Small organic molecule
Emp. Form.:
C23H22FN5
Mol. Mass.:
387.4527
SMILES:
Cc1ccc(cc1)-c1cnc(NCC2(F)CCNC2)nc1-c1ccc(cc1)C#N
: