Target
Lysine-specific histone demethylase 1A
Ligand
BDBM301042
Substrate
Meas. Tech.
In Vitro Enzyme Inhibition Assay - LSD-1
IC50
<10±n/a nM
Citation
 Chen, YKKanouni, TKaldor, SWStafford, JAVeal, JM Inhibitors of lysine specific demethylase-1 US Patent  US10131664 Publication Date 11/20/2018 
Target
Name:
Lysine-specific histone demethylase 1A
Synonyms:
AOF2 Flavin-containing amine oxidase domain-containing protein 2 KDM1A KIAA0601 Lysine-specific demethylase 1 (LSD1) Lysine-specific histone demethylase 1 (LSD1)
Type:
Enzyme
Mol. Mass.:
92901.01
Organism:
Homo sapiens (Human)
Description:
O60341
Residue:
852
  
Inhibitor
Name:
BDBM301042
Synonyms:
4-(2-{2,7-diazaspiro[4.4]nonan-2-yl}- 5-(4-methylphenyl)pyrimidin-4- yl)benzonitrile US10543198, Example 35 | US10864202, Example 35
Type:
Small organic molecule
Emp. Form.:
C25H25N5
Mol. Mass.:
395.4995
SMILES:
Cc1ccc(cc1)-c1cnc(nc1-c1ccc(cc1)C#N)N1CCC2(CCNC2)C1
: