Target
Lysine-specific histone demethylase 1A
Ligand
BDBM301081
Substrate
Meas. Tech.
In Vitro Enzyme Inhibition Assay - LSD-1
IC50
<10±n/a nM
Citation
 Chen, YKKanouni, TKaldor, SWStafford, JAVeal, JM Inhibitors of lysine specific demethylase-1 US Patent  US10131664 Publication Date 11/20/2018 
Target
Name:
Lysine-specific histone demethylase 1A
Synonyms:
AOF2 Flavin-containing amine oxidase domain-containing protein 2 KDM1A KIAA0601 Lysine-specific demethylase 1 (LSD1) Lysine-specific histone demethylase 1 (LSD1)
Type:
Enzyme
Mol. Mass.:
92901.01
Organism:
Homo sapiens (Human)
Description:
O60341
Residue:
852
  
Inhibitor
Name:
BDBM301081
Synonyms:
4-[2-(4-aminopiperidin-1-yl)-5-(2- methoxypyrimidin-5-yl)pyrimidin-4- yl]benzonitrile | US10131664, Example 74
Type:
Small organic molecule
Emp. Form.:
C21H21N7O
Mol. Mass.:
387.4377
SMILES:
COc1ncc(cn1)-c1cnc(nc1-c1ccc(cc1)C#N)N1CCC(N)CC1
: