Target
Lysine-specific histone demethylase 1A
Ligand
BDBM301132
Substrate
Meas. Tech.
In Vitro Enzyme Inhibition Assay - LSD-1
IC50
<10±n/a nM
Citation
 Chen, YKKanouni, TKaldor, SWStafford, JAVeal, JM Inhibitors of lysine specific demethylase-1 US Patent  US10131664 Publication Date 11/20/2018 
Target
Name:
Lysine-specific histone demethylase 1A
Synonyms:
AOF2 Flavin-containing amine oxidase domain-containing protein 2 KDM1A KIAA0601 Lysine-specific demethylase 1 (LSD1) Lysine-specific histone demethylase 1 (LSD1)
Type:
Enzyme
Mol. Mass.:
92901.01
Organism:
Homo sapiens (Human)
Description:
O60341
Residue:
852
  
Inhibitor
Name:
BDBM301132
Synonyms:
4-[2-(4-aminopiperidin-1-yl)-5-(6- fluoro-1-methylbenzimidazol-5- yl)pyrimidin-4-yl]benzonitrile | US10131664, Example 125
Type:
Small organic molecule
Emp. Form.:
C24H22FN7
Mol. Mass.:
427.4768
SMILES:
Cn1cnc2cc(c(F)cc12)-c1cnc(nc1-c1ccc(cc1)C#N)N1CCC(N)CC1
: