Target
Lysine-specific histone demethylase 1A
Ligand
BDBM301171
Substrate
Meas. Tech.
In Vitro Enzyme Inhibition Assay - LSD-1
IC50
<10±n/a nM
Citation
 Chen, YKKanouni, TKaldor, SWStafford, JAVeal, JM Inhibitors of lysine specific demethylase-1 US Patent  US10131664 Publication Date 11/20/2018 
Target
Name:
Lysine-specific histone demethylase 1A
Synonyms:
AOF2 Flavin-containing amine oxidase domain-containing protein 2 KDM1A KIAA0601 Lysine-specific demethylase 1 (LSD1) Lysine-specific histone demethylase 1 (LSD1)
Type:
Enzyme
Mol. Mass.:
92901.01
Organism:
Homo sapiens (Human)
Description:
O60341
Residue:
852
  
Inhibitor
Name:
BDBM301171
Synonyms:
4-[2-(4-aminopiperidin-1-yl)-5-(1- methyl-1H-indazol-5-yl)-6- (methylamino)pyrimidin-4- yl]benzonitrile | US10131664, Example 164
Type:
Small organic molecule
Emp. Form.:
C25H28N8
Mol. Mass.:
440.5434
SMILES:
CNc1nc(nc(-c2ccc(cc2)C#N)c1C1=CC2C=NN(C)C2C=C1)N1CCC(N)CC1
: