Target
Endothelin-1
Ligand
BDBM168722
Substrate
Meas. Tech.
ET-1 Assay
EC50
<50000±n/a nM
Citation
 PubChem, PCBuckman, BONicholas, JBRamphal, JYEmayan, KSeiwert, SD Anti-fibrotic pyridinones US Patent  US9675593 Publication Date 6/13/2017 
Target
Name:
Endothelin-1
Synonyms:
EDN1 PPET1 | Preproendothelin-1
Type:
Protein
Mol. Mass.:
24444.51
Organism:
Homo sapiens (Human)
Description:
P05305
Residue:
212
  
Inhibitor
Name:
BDBM168722
Synonyms:
US9675593, 157
Type:
Small organic molecule
Emp. Form.:
C25H19F3N4O4
Mol. Mass.:
496.438
SMILES:
CCOc1ccc(Oc2cc(=O)n(cc2-c2cnn(C)c2)-c2ccc(OC(F)(F)F)cc2)cc1C#N
: