Target
Endothelin-1
Ligand
BDBM172570
Substrate
Meas. Tech.
ET-1 Assay
EC50
<50000±n/a nM
Citation
 PubChem, PCBuckman, BONicholas, JBRamphal, JYEmayan, KSeiwert, SD Anti-fibrotic pyridinones US Patent  US9675593 Publication Date 6/13/2017 
Target
Name:
Endothelin-1
Synonyms:
EDN1 PPET1 | Preproendothelin-1
Type:
Protein
Mol. Mass.:
24444.51
Organism:
Homo sapiens (Human)
Description:
P05305
Residue:
212
  
Inhibitor
Name:
BDBM172570
Synonyms:
US9675593, 620
Type:
Small organic molecule
Emp. Form.:
C17H13F3N6O2
Mol. Mass.:
390.3193
SMILES:
CCn1nc2c(cn(-c3ccc(OC(F)(F)F)cc3)c(=O)c2n1)-c1cn[nH]c1
: