Target
Cyclin-dependent kinase 2/G1/S-specific cyclin-E1
Ligand
BDBM7649
Substrate
GST-Rb fusion protein
Meas. Tech.
CDK Assay
pH
7±n/a
Temperature
295.15±n/a K
IC50
6±n/a nM
Citation
 Anderson, MBeattie, JFBreault, GABreed, JByth, KFCulshaw, JDEllston, RPGreen, SMinshull, CANorman, RAPauptit, RAStanway, JThomas, APJewsbury, PJ Imidazo[1,2-a]pyridines: a potent and selective class of cyclin-dependent kinase inhibitors identified through structure-based hybridisation. Bioorg Med Chem Lett 13:3021-6 (2003)  
Target
Name:
Cyclin-dependent kinase 2/G1/S-specific cyclin-E1
Synonyms:
CDK2/CycE CDK2/E Cyclin-Dependent Kinase 2 (CDK2) Cyclin-dependent kinase 2/cyclin E1
Type:
Protein
Mol. Mass.:
Description:
Components:
This complex has 2 components.
Component 1
Name:
Cyclin-dependent kinase 2
Synonyms:
CDK2 CDK2_HUMAN Cell division protein kinase 2 Protein cereblon/Cyclin-dependent kinase 2 | p33 protein kinase
Type:
Enzyme Subunit
Mol. Mass.:
33938.17
Organism:
Homo sapiens (Human)
Description:
P24941
Residue:
298
  
Component 2
Name:
G1/S-specific cyclin-E1
Synonyms:
CCNE CCNE1_HUMAN
Type:
Enzyme Subunit
Mol. Mass.:
47073.17
Organism:
Homo sapiens (Human)
Description:
Residue:
410
  
Inhibitor
Name:
BDBM7649
Synonyms:
2,4-bisanilinopyrimidine deriv. 9 | 4-({4-[(2-fluoro-5-methylphenyl)amino]pyrimidin-2-yl}amino)benzene-1-sulfonamide
Type:
Small organic molecule
Emp. Form.:
C17H16FN5O2S
Mol. Mass.:
373.405
SMILES:
Cc1ccc(F)c(Nc2ccnc(Nc3ccc(cc3)S(N)(=O)=O)n2)c1
:
Substrate
Name:
GST-Rb fusion protein
Synonyms:
Glutathione S-transferase (GST)-retinoblastoma (Rb) fusion RB1 Rb | retinoblastoma
Type:
Other Protein Type
Mol. Mass.:
106410.17
Organism:
Homo sapiens (Human)
Description:
GST-60 kDa Rb fusion protein (comprising amino acids 378 to 928 of retinoblastoma)
Residue:
928