Target
Cyclin-dependent kinase 2/G1/S-specific cyclin-E1
Ligand
BDBM7660
Substrate
GST-Rb fusion protein
Meas. Tech.
CDK Assay
pH
7±n/a
Temperature
295.15±n/a K
IC50
4±n/a nM
Citation
 Byth, KFCulshaw, JDGreen, SOakes, SEThomas, AP Imidazo[1,2-a]pyridines. Part 2: SAR and optimisation of a potent and selective class of cyclin-dependent kinase inhibitors. Bioorg Med Chem Lett 14:2245-8 (2004)  
Target
Name:
Cyclin-dependent kinase 2/G1/S-specific cyclin-E1
Synonyms:
CDK2/CycE CDK2/E Cyclin-Dependent Kinase 2 (CDK2) Cyclin-dependent kinase 2/cyclin E1
Type:
Protein
Mol. Mass.:
Description:
Components:
This complex has 2 components.
Component 1
Name:
Cyclin-dependent kinase 2
Synonyms:
CDK2 CDK2_HUMAN Cell division protein kinase 2 Protein cereblon/Cyclin-dependent kinase 2 | p33 protein kinase
Type:
Enzyme Subunit
Mol. Mass.:
33938.17
Organism:
Homo sapiens (Human)
Description:
P24941
Residue:
298
  
Component 2
Name:
G1/S-specific cyclin-E1
Synonyms:
CCNE CCNE1_HUMAN
Type:
Enzyme Subunit
Mol. Mass.:
47073.17
Organism:
Homo sapiens (Human)
Description:
Residue:
410
  
Inhibitor
Name:
BDBM7660
Synonyms:
4-[(4-{imidazo[1,2-a]pyridin-3-yl}pyrimidin-2-yl)amino]-N-(3-methoxypropyl)benzene-1-sulfonamide | sulfonamide deriv. 3c
Type:
Small organic molecule
Emp. Form.:
C21H22N6O3S
Mol. Mass.:
438.503
SMILES:
COCCCNS(=O)(=O)c1ccc(Nc2nccc(n2)-c2cnc3ccccn23)cc1
:
Substrate
Name:
GST-Rb fusion protein
Synonyms:
Glutathione S-transferase (GST)-retinoblastoma (Rb) fusion RB1 Rb | retinoblastoma
Type:
Other Protein Type
Mol. Mass.:
106410.17
Organism:
Homo sapiens (Human)
Description:
GST-60 kDa Rb fusion protein (comprising amino acids 378 to 928 of retinoblastoma)
Residue:
928