Target
Cyclin-dependent kinase 2/G1/S-specific cyclin-E1
Ligand
BDBM7676
Substrate
GST-Rb fusion protein
Meas. Tech.
CDK Assay
pH
7±n/a
Temperature
295.15±n/a K
IC50
600±n/a nM
Citation
 Byth, KFCooper, NCulshaw, JDHeaton, DWOakes, SEMinshull, CANorman, RAPauptit, RATucker, JABreed, JPannifer, ARowsell, SStanway, JJValentine, ALThomas, AP Imidazo[1,2-b]pyridazines: a potent and selective class of cyclin-dependent kinase inhibitors. Bioorg Med Chem Lett 14:2249-52 (2004)  
Target
Name:
Cyclin-dependent kinase 2/G1/S-specific cyclin-E1
Synonyms:
CDK2/CycE CDK2/E Cyclin-Dependent Kinase 2 (CDK2) Cyclin-dependent kinase 2/cyclin E1
Type:
Protein
Mol. Mass.:
Description:
Components:
This complex has 2 components.
Component 1
Name:
Cyclin-dependent kinase 2
Synonyms:
CDK2 CDK2_HUMAN Cell division protein kinase 2 Protein cereblon/Cyclin-dependent kinase 2 | p33 protein kinase
Type:
Enzyme Subunit
Mol. Mass.:
33938.17
Organism:
Homo sapiens (Human)
Description:
P24941
Residue:
298
  
Component 2
Name:
G1/S-specific cyclin-E1
Synonyms:
CCNE CCNE1_HUMAN
Type:
Enzyme Subunit
Mol. Mass.:
47073.17
Organism:
Homo sapiens (Human)
Description:
Residue:
410
  
Inhibitor
Name:
BDBM7676
Synonyms:
4-[(4-{imidazo[1,2-a]pyridazin-3-yl}pyrimidin-2-yl)amino]-N-(2-methoxyethyl)-N-methylbenzene-1-sulfonamide | Imidazo[1,2-b]pyridazine deriv. 2f
Type:
Small organic molecule
Emp. Form.:
C20H21N7O3S
Mol. Mass.:
439.491
SMILES:
COCCN(C)S(=O)(=O)c1ccc(Nc2nccc(n2)-c2cnc3cccnn23)cc1
:
Substrate
Name:
GST-Rb fusion protein
Synonyms:
Glutathione S-transferase (GST)-retinoblastoma (Rb) fusion RB1 Rb | retinoblastoma
Type:
Other Protein Type
Mol. Mass.:
106410.17
Organism:
Homo sapiens (Human)
Description:
GST-60 kDa Rb fusion protein (comprising amino acids 378 to 928 of retinoblastoma)
Residue:
928