Target
Cyclin-dependent kinase/G2/mitotic-specific cyclin- 1
Ligand
BDBM7690
Substrate
Peptide Substrate
Meas. Tech.
Kinase Inhibition SPA Assay
pH
7.5±n/a
Temperature
295.15±n/a K
IC50
46±n/a nM
Citation
 Bramson, HNCorona, JDavis, STDickerson, SHEdelstein, MFrye, SVGampe, RTHarris, PAHassell, AHolmes, WDHunter, RNLackey, KELovejoy, BLuzzio, MJMontana, VRocque, WJRusnak, DShewchuk, LVeal, JMWalker, DHKuyper, LF Oxindole-based inhibitors of cyclin-dependent kinase 2 (CDK2): design, synthesis, enzymatic activities, and X-ray crystallographic analysis. J Med Chem 44:4339-58 (2001)  
Target
Name:
Cyclin-dependent kinase/G2/mitotic-specific cyclin- 1
Synonyms:
CDK1/B CDK1/CyclinB Cyclin-Dependent Kinase 1 (CDK1) Cyclin-dependent kinase/G2/mitotic-specific cyclin 1 | cdk1
Type:
Protein Complex
Mol. Mass.:
Description:
CDK1/Cyclin B complexes were purified from insect cells co-infected with baculovirus vectors containing each of the components.
Components:
This complex has 2 components.
Component 1
Name:
Cyclin-dependent kinase 1
Synonyms:
CDC2 CDK1 CDKN1 Cell division protein kinase 1 P34CDC2 | p34 protein kinase
Type:
Enzyme Subunit
Mol. Mass.:
34101.08
Organism:
Homo sapiens (Human)
Description:
P06493
Residue:
297
  
Component 2
Name:
G2/mitotic-specific cyclin-B1
Synonyms:
CCNB CCNB1_HUMAN
Type:
Enzyme Subunit
Mol. Mass.:
48340.95
Organism:
Homo sapiens (Human)
Description:
P14635
Residue:
433
  
Inhibitor
Name:
BDBM7690
Synonyms:
4-[2-(4-Ethyl-2-oxo-1,2-dihydro-3H-indol-3-ylidene)hydrazino]benzenesulfonamide Oxindole-Based Inhibitor 26
Type:
Small organic molecule
Emp. Form.:
C16H16N4O3S
Mol. Mass.:
344.388
SMILES:
CCc1cccc2NC(=O)C(=NNc3ccc(cc3)S(N)(=O)=O)c12
:
Substrate
Name:
Peptide Substrate
Synonyms:
Type:
Peptide
Mol. Mass.:
5198.94
Organism:
Description:
Residue:
46