Target
Fibroblast growth factor receptor 2
Ligand
BDBM301198
Substrate
IC50
<100±n/a nM
Citation
 Wu, LZhang, CHe, CLu, LYao, W Substituted tricyclic compounds as FGFR inhibitors US Patent  US10131667 Publication Date 11/20/2018 
Target
Name:
Fibroblast growth factor receptor 2
Synonyms:
BEK FGFR-2 FGFR2 Fibroblast growth factor receptor 2 (FGFR2) KGFR Keratinocyte growth factor receptor VEGF-receptor 2 and Fibroblast growth factor receptor 2
Type:
Enzyme
Mol. Mass.:
92015.45
Organism:
Homo sapiens (Human)
Description:
P21802
Residue:
821
  
Inhibitor
Name:
BDBM301198
Synonyms:
3-(2-Chloro-3,5-dimethoxyphenyl)-8-[1-(2-hydroxyethyl)-1H-pyrazol-4-yl]-1-methyl-1,3,4,7-tetrahydro-2H-pyrrolo[3',2':5,6]pyrido[4,3-d]pyrimidin-2-one US11053246, Example 14 | US9611267, Example 14
Type:
Small organic molecule
Emp. Form.:
C23H23ClN6O4
Mol. Mass.:
482.92
SMILES:
COc1cc(OC)c(Cl)c(c1)N1Cc2cnc3[nH]c(cc3c2N(C)C1=O)-c1cnn(CCO)c1
: