Target
Fibroblast growth factor receptor 1
Ligand
BDBM301335
Substrate
Meas. Tech.
FGFR Enzymatic Assay
IC50
<100±n/a nM
Citation
 Wu, LZhang, CHe, CLu, LYao, W Substituted tricyclic compounds as FGFR inhibitors US Patent  US10131667 Publication Date 11/20/2018 
Target
Name:
Fibroblast growth factor receptor 1
Synonyms:
BFGFR Basic fibroblast growth factor receptor 1 (FGFR1) CEK FGFR-1 FGFR-1, (FL) FGFR1_HUMAN FLT2 Fibroblast growth factor receptor 1 (FGFR-1) Fms-like tyrosine kinase 2 N-sam bFGF-R | c-fgr
Type:
Receptor
Mol. Mass.:
91861.70
Organism:
Homo sapiens (Human)
Description:
P11362
Residue:
822
  
Inhibitor
Name:
BDBM301335
Synonyms:
7'-(2,6-difluoro-3,5-dimethoxyphenyl)-1-methyl-6',7'-dihydrospiro[piperidine-4,9'-pyrrolo[2,3-c][2,7]naphthyridin]-8'(3'H)-one US11053246, Example 151 | US9611267, Example 151
Type:
Small organic molecule
Emp. Form.:
C23H24F2N4O3
Mol. Mass.:
442.4585
SMILES:
COc1cc(OC)c(F)c(N2Cc3cnc4[nH]ccc4c3C3(CCN(C)CC3)C2=O)c1F
: