Target
Cystic fibrosis transmembrane conductance regulator
Ligand
BDBM301421
Substrate
Meas. Tech.
FRT Ion Flux Assay of F508del CFTR Potentiation
EC50
2.13±n/a nM
Citation
 Strohbach, JWLimburg, DCMathias, JPThorarensen, AMousseau, JJDenny, RAZapf, CWEfremov, IV Bicyclic heteroaryl derivatives as CFTR potentiators US Patent  US10131670 Publication Date 11/20/2018 
Target
Name:
Cystic fibrosis transmembrane conductance regulator
Synonyms:
ABCC7 CFTR Channel conductance-controlling ATPase | cAMP-dependent chloride channel
Type:
Enzyme Catalytic Domain
Mol. Mass.:
168171.30
Organism:
Homo sapiens (Human)
Description:
gi_90421313
Residue:
1480
  
Inhibitor
Name:
BDBM301421
Synonyms:
4-amino-7-{1-[1-(2-fluorophenyl)-1H-1,2,3-triazol-4-yl]propyl}-5-[2-(trifluoromethyl)pyrimidin-5-yl]pyrrolo[2,1-f][1,2,4]triazine-6-carbonitrile,enantiomer 1 US10131670, Example 4 | US10131670, Example 5
Type:
Small organic molecule
Emp. Form.:
C23H16F4N10
Mol. Mass.:
508.4338
SMILES:
CCC(c1cn(nn1)-c1ccccc1F)c1c(C#N)c(-c2cnc(nc2)C(F)(F)F)c2c(N)ncnn12
: