Target
Cystic fibrosis transmembrane conductance regulator
Ligand
BDBM301423
Substrate
Meas. Tech.
Chamber Electrophysiology Assay of CFTR Potentiation in CF Bronchial Epithelial Cells
EC50
5.48±n/a nM
Citation
 Strohbach, JWLimburg, DCMathias, JPThorarensen, AMousseau, JJDenny, RAZapf, CWEfremov, IV Bicyclic heteroaryl derivatives as CFTR potentiators US Patent  US10131670 Publication Date 11/20/2018 
Target
Name:
Cystic fibrosis transmembrane conductance regulator
Synonyms:
ABCC7 CFTR Channel conductance-controlling ATPase | cAMP-dependent chloride channel
Type:
Enzyme Catalytic Domain
Mol. Mass.:
168171.30
Organism:
Homo sapiens (Human)
Description:
gi_90421313
Residue:
1480
  
Inhibitor
Name:
BDBM301423
Synonyms:
4-amino-7-{1-[1-(2,4-difluorophenyl)-1H-1,2,3-triazol-4-yl]propyl}-5-[2-(trifluoromethyl)pyrimidin-5-yl]pyrrolo[2,1-f][1,2,4]triazine-6-carbonitrile,enantiomer 1 US10131670, Example 7
Type:
Small organic molecule
Emp. Form.:
C23H15F5N10
Mol. Mass.:
526.4242
SMILES:
CCC(c1cn(nn1)-c1ccc(F)cc1F)c1c(C#N)c(-c2cnc(nc2)C(F)(F)F)c2c(N)ncnn12
: