Target
Cystic fibrosis transmembrane conductance regulator
Ligand
BDBM301442
Substrate
Meas. Tech.
Chamber Electrophysiology Assay of CFTR Potentiation in CF Bronchial Epithelial Cells
EC50
0.860±n/a nM
Citation
 Strohbach, JWLimburg, DCMathias, JPThorarensen, AMousseau, JJDenny, RAZapf, CWEfremov, IV Bicyclic heteroaryl derivatives as CFTR potentiators US Patent  US10131670 Publication Date 11/20/2018 
Target
Name:
Cystic fibrosis transmembrane conductance regulator
Synonyms:
ABCC7 CFTR Channel conductance-controlling ATPase | cAMP-dependent chloride channel
Type:
Enzyme Catalytic Domain
Mol. Mass.:
168171.30
Organism:
Homo sapiens (Human)
Description:
gi_90421313
Residue:
1480
  
Inhibitor
Name:
BDBM301442
Synonyms:
4-amino-7-{[1-(2-fluorophenyl)-1H-pyrazol-4-yl]methyl}-5-[2-(trifluoromethyl)pyrimidin-5-yl]pyrrolo[2,1-f][1,2,4]triazine-6-carbonitrile | US10131670, Example 30
Type:
Small organic molecule
Emp. Form.:
C22H13F4N9
Mol. Mass.:
479.3925
SMILES:
Nc1ncnn2c(Cc3cnn(c3)-c3ccccc3F)c(C#N)c(-c3cnc(nc3)C(F)(F)F)c12
: