Target
Cystic fibrosis transmembrane conductance regulator
Ligand
BDBM301453
Substrate
Meas. Tech.
Chamber Electrophysiology Assay of CFTR Potentiation in CF Bronchial Epithelial Cells
EC50
9.95±n/a nM
Citation
 Strohbach, JWLimburg, DCMathias, JPThorarensen, AMousseau, JJDenny, RAZapf, CWEfremov, IV Bicyclic heteroaryl derivatives as CFTR potentiators US Patent  US10131670 Publication Date 11/20/2018 
Target
Name:
Cystic fibrosis transmembrane conductance regulator
Synonyms:
ABCC7 CFTR Channel conductance-controlling ATPase | cAMP-dependent chloride channel
Type:
Enzyme Catalytic Domain
Mol. Mass.:
168171.30
Organism:
Homo sapiens (Human)
Description:
gi_90421313
Residue:
1480
  
Inhibitor
Name:
BDBM301453
Synonyms:
7-{1-[1-(2,5-difluorophenyl)-1H-1,2,3-triazol-4-yl]propyl}-5-[2-(trifluoromethyl)pyrimidin-5-yl]pyrrolo[2,1-f][1,2,4]triazin-4-amine,enantiomer 1 US10131670, Example 62
Type:
Small organic molecule
Emp. Form.:
C22H16F5N9
Mol. Mass.:
501.4148
SMILES:
CCC(c1cn(nn1)-c1cc(F)ccc1F)c1cc(-c2cnc(nc2)C(F)(F)F)c2c(N)ncnn12
: