Target
Cystic fibrosis transmembrane conductance regulator
Ligand
BDBM301458
Substrate
Meas. Tech.
Chamber Electrophysiology Assay of CFTR Potentiation in CF Bronchial Epithelial Cells
EC50
123±n/a nM
Citation
 Strohbach, JWLimburg, DCMathias, JPThorarensen, AMousseau, JJDenny, RAZapf, CWEfremov, IV Bicyclic heteroaryl derivatives as CFTR potentiators US Patent  US10131670 Publication Date 11/20/2018 
Target
Name:
Cystic fibrosis transmembrane conductance regulator
Synonyms:
ABCC7 CFTR Channel conductance-controlling ATPase | cAMP-dependent chloride channel
Type:
Enzyme Catalytic Domain
Mol. Mass.:
168171.30
Organism:
Homo sapiens (Human)
Description:
gi_90421313
Residue:
1480
  
Inhibitor
Name:
BDBM301458
Synonyms:
7-{1-[1-(2-fluorophenyl)-1H-1,2,3-triazol-4-yl]propyl}-5-(4-methoxypyrimidin-5-yl)pyrrolo[2,1-f][1,2,4]triazin-4-amine,enantiomer 2 | US10131670, Example 66
Type:
Small organic molecule
Emp. Form.:
C22H20FN9O
Mol. Mass.:
445.4523
SMILES:
CC[C@@H](c1cn(nn1)-c1ccccc1F)c1cc(-c2cncnc2OC)c2c(N)ncnn12
: