Target
Protein M2-1
Ligand
BDBM301492
Substrate
Meas. Tech.
Antiviral Activity
EC50
19.5±n/a nM
Citation
 Tahari, AVendeville, SMJonckers, THRaboisson, PJDemin, SDHu, L Piperidine substituted tricyclic pyrazolo[1,5-a]pyrimidine derivatives with inhibitory activity on the replication of the respiratory syncytial virus (RSV) US Patent  US10131673 Publication Date 11/20/2018 
Target
Name:
Protein M2-1
Synonyms:
Envelope-associated 22 kDa protein M21_HRSVA | Matrix M2-1
Type:
Enzyme Catalytic Domain
Mol. Mass.:
22163.59
Organism:
Human respiratory syncytial virus A (strain A2)
Description:
P04545
Residue:
194
  
Inhibitor
Name:
BDBM301492
Synonyms:
N-(2-(2-(9-amino-5,6,7,8-tetrahydropyrazolo[5,1-b]quinazolin-2-yl)-piperidine-1-carbonyl)-4-methylphenyl)methanesulfonamide | US10131673, Compound P19
Type:
Small organic molecule
Emp. Form.:
C24H30N6O3S
Mol. Mass.:
482.598
SMILES:
Cc1ccc(NS(C)(=O)=O)c(c1)C(=O)N1CCCCC1c1cc2nc3CCCCc3c(N)n2n1
: